General: Improve performance of exercise participations view #5
test.yml
on: push
server-tests
15m 34s
server-style
3m 56s
client-tests
16m 52s
client-tests-selected
1m 16s
client-style
2m 36s
client-compilation
53s
Annotations
8 errors and 3 warnings
test#L0
Junit Results ran 8407 in 1375.2059999999994 seconds 0 Errored, 2 Failed, 2 Skipped
|
resumeProgrammingExerciseByTriggeringInstructorBuild_correctInitializationState(ExerciseMode) [1] exerciseMode=INDIVIDUAL:
/home/runner/work/Artemis/Artemis/src/test/java/de/tum/cit/aet/artemis/programming/ProgrammingExerciseGitlabJenkinsIntegrationTest.java#L0
Junit test resumeProgrammingExerciseByTriggeringInstructorBuild_correctInitializationState(ExerciseMode) [1] exerciseMode=INDIVIDUAL failed org.awaitility.core.ConditionTimeoutException: Condition with Lambda expression in de.tum.cit.aet.artemis.programming.util.ProgrammingExerciseTestService was not fulfilled within 20 seconds.
|
testFetchPush_instructorExamTestRun():
/home/runner/work/Artemis/Artemis/src/test/java/de/tum/cit/aet/artemis/programming/icl/LocalVCLocalCIIntegrationTest.java#L737
Junit test testFetchPush_instructorExamTestRun() failed org.awaitility.core.ConditionTimeoutException: Condition with Lambda expression in de.tum.cit.aet.artemis.programming.icl.LocalVCLocalCITestService was not fulfilled within 20 seconds.
|
de.tum.cit.aet.artemis.programming.icl.LocalVCLocalCIIntegrationTest ► testFetchPush_instructorExamTestRun():
src/test/java/de/tum/cit/aet/artemis/programming/icl/LocalVCLocalCITestService.java#L580
Failed test found in:
build/test-results/test/TEST-de.tum.cit.aet.artemis.programming.icl.LocalVCLocalCIIntegrationTest.xml
Error:
org.awaitility.core.ConditionTimeoutException: Condition with Lambda expression in de.tum.cit.aet.artemis.programming.icl.LocalVCLocalCITestService was not fulfilled within 20 seconds.
|
de.tum.cit.aet.artemis.programming.ProgrammingExerciseGitlabJenkinsIntegrationTest ► resumeProgrammingExerciseByTriggeringInstructorBuild_correctInitializationState(ExerciseMode) [1] exerciseMode=INDIVIDUAL:
src/test/java/de/tum/cit/aet/artemis/programming/util/ProgrammingExerciseTestService.java#L1483
Failed test found in:
build/test-results/test/TEST-de.tum.cit.aet.artemis.programming.ProgrammingExerciseGitlabJenkinsIntegrationTest.xml
Error:
org.awaitility.core.ConditionTimeoutException: Condition with Lambda expression in de.tum.cit.aet.artemis.programming.util.ProgrammingExerciseTestService was not fulfilled within 20 seconds.
|
server-tests
Process completed with exit code 1.
|
server-tests
Process completed with exit code 1.
|
server-tests
Failed test were found and 'fail-on-error' option is set to true
|
server-tests
The following actions use a deprecated Node.js version and will be forced to run on node20: ashley-taylor/junit-report-annotations-action@f9c1a5cbe28479439f82b80a5402a6d3aa1990ac. For more info: https://github.blog/changelog/2024-03-07-github-actions-all-actions-will-run-on-node20-instead-of-node16-by-default/
|
server-tests
No files were found with the provided path: build/reports/jacoco/test/html/. No artifacts will be uploaded.
|
server-tests
Test report summary exceeded limit of 65535 bytes and will be trimmed
|
Artifacts
Produced during runtime
Name | Size | |
---|---|---|
Coverage Report Client Tests
|
6.32 MB |
|